'pgsql_mnesia'

Results for big_tests.tests.graphql_gdpr_SUITE

Test started at 2024-03-15 15:28:00

Host info:
Run on ff12a10d03ed
Used Erlang v14.1.1 in "/usr/local/lib/erlang"

Executing 20 test cases...

NumModuleGroupCaseLogTimeResultComment
graphql_gdpr_SUITEinit_per_suite< >0.000sOk
graphql_gdpr_SUITEadmin_gdpr_httpinit_per_group< >0.000sFAILED{distributed_helper,rpc,140}
{badrpc,{'EXIT',{...}}}
1graphql_gdpr_SUITEadmin_gdpr_httpadmin_retrieve_user_data< >0.000sSKIPPEDinit_per_group failed
2graphql_gdpr_SUITEadmin_gdpr_httpadmin_retrieve_user_data_with_unprepped_name< >0.000sSKIPPEDinit_per_group failed
3graphql_gdpr_SUITEadmin_gdpr_httpadmin_gdpr_no_user_test< >0.000sSKIPPEDinit_per_group failed
4graphql_gdpr_SUITEadmin_gdpr_httpadmin_gdpr_empty_filename_test< >0.000sSKIPPEDinit_per_group failed
5graphql_gdpr_SUITEadmin_gdpr_httpadmin_gdpr_access_denied_erofs< >0.000sSKIPPEDinit_per_group failed
6graphql_gdpr_SUITEadmin_gdpr_httpadmin_gdpr_access_denied_eacces< >0.000sSKIPPEDinit_per_group failed
7graphql_gdpr_SUITEadmin_gdpr_httpadmin_gdpr_access_denied_exit< >0.000sSKIPPEDinit_per_group failed
8graphql_gdpr_SUITEadmin_gdpr_httpadmin_gdpr_access_denied_filename_is_a_directory< >0.000sSKIPPEDinit_per_group failed
graphql_gdpr_SUITEadmin_gdpr_httpend_per_group< >0.000sSKIPPEDinit_per_group failed
graphql_gdpr_SUITEadmin_gdpr_cliinit_per_group< >0.000sFAILED{distributed_helper,rpc,140}
{badrpc,{'EXIT',{...}}}
9graphql_gdpr_SUITEadmin_gdpr_cliadmin_retrieve_user_data< >0.000sSKIPPEDinit_per_group failed
10graphql_gdpr_SUITEadmin_gdpr_cliadmin_retrieve_user_data_with_unprepped_name< >0.000sSKIPPEDinit_per_group failed
11graphql_gdpr_SUITEadmin_gdpr_cliadmin_gdpr_no_user_test< >0.000sSKIPPEDinit_per_group failed
12graphql_gdpr_SUITEadmin_gdpr_cliadmin_gdpr_empty_filename_test< >0.000sSKIPPEDinit_per_group failed
13graphql_gdpr_SUITEadmin_gdpr_cliadmin_gdpr_access_denied_erofs< >0.000sSKIPPEDinit_per_group failed
14graphql_gdpr_SUITEadmin_gdpr_cliadmin_gdpr_access_denied_eacces< >0.000sSKIPPEDinit_per_group failed
15graphql_gdpr_SUITEadmin_gdpr_cliadmin_gdpr_access_denied_exit< >0.000sSKIPPEDinit_per_group failed
16graphql_gdpr_SUITEadmin_gdpr_cliadmin_gdpr_access_denied_filename_is_a_directory< >0.000sSKIPPEDinit_per_group failed
graphql_gdpr_SUITEadmin_gdpr_cliend_per_group< >0.000sSKIPPEDinit_per_group failed
graphql_gdpr_SUITEdomain_admin_gdprinit_per_group< >0.000sFAILED{distributed_helper,rpc,140}
{badrpc,{'EXIT',{...}}}
17graphql_gdpr_SUITEdomain_admin_gdpradmin_retrieve_user_data< >0.000sSKIPPEDinit_per_group failed
18graphql_gdpr_SUITEdomain_admin_gdpradmin_retrieve_user_data_with_unprepped_name< >0.000sSKIPPEDinit_per_group failed
19graphql_gdpr_SUITEdomain_admin_gdpradmin_gdpr_no_user_test< >0.000sSKIPPEDinit_per_group failed
20graphql_gdpr_SUITEdomain_admin_gdprdomain_admin_retrieve_user_data_no_permission< >0.000sSKIPPEDinit_per_group failed
graphql_gdpr_SUITEdomain_admin_gdprend_per_group< >0.000sSKIPPEDinit_per_group failed
graphql_gdpr_SUITEend_per_suite< >0.000sOk
TOTAL0.215sOk0 Ok, 0 Failed, 20 Skipped of 20


Test run history | Top level test index | Latest test result